{"text_format":"1","workbook":"xlsx","n_sheets":4,"sheets":["Control","Hire Purchase","Journal Worksheet","Sheet1"],"not_rendered":{"charts":0,"images":5,"macros":1,"external_links":0,"defined_names":10,"comments":1,"pivot_tables":0},"unopened":[],"bounds":{"document_bytes":16777216,"sheet_cells":100000,"rows_first":2000,"rows_last":500,"rows_between":2000,"halvings":0,"cell_chars":16384,"cell_head_chars":4096},"cells_cut":0,"cells_raw":0,"read":"whole","date_system":"1900"}

{"sheet":"Control","index":0,"n_rows":108,"n_cols":13,"rows_kept":108,"cut":false,"hidden":true,"merged":[[0,9,0,12]]}
[null,null,null,null,null,null,null,null,null,"NO ROLLING FORWARD REQUIRED"]
[]
[null,null,null,null,null,null,null,null,null,"Borrowing Expenses for Write-Off",null,null,100]
[null,null,null,null,null,null,null,null,null,"Borrowing Expenses Max Period",null,null,60]
["Version 1 Update",null,null,null,null,null,null,null,null,"Month commenced",null,{"$f":"MONTH('Hire Purchase'!$I$10)","v":1}]
[null,null,null,null,null,null,null,null,null,"End of First Year",null,{"$f":"IF($L$5<=6,6-$L$5+1,6+12-$L$5+1)","v":6}]
["There was an update to this first version in Financial Calcs",null,null,null,null,null,null,null,null,"End of Second Year",null,{"$f":"L6+12","v":18}]
["It fixed an error in picking up bals for the Journal sheet",null,null,null,null,null,null,null,null,"End of Third Year",null,30]
["It was done one day after worksheet published.",null,null,null,null,null,null,null,null,"End of Fourth Year",null,42]
["So didn't create a new version number",null,null,null,null,null,null,null,null,"End of Fifth Year",null,54]
[null,null,null,null,null,null,null,null,null,"End of Sixth Year",null,66]
[null,null,null,null,null,null,null,null,null,"End of Seventh Year",null,78]
["Version 2 Update",null,null,null,null,null,null,null,null,"End of Eighth Year",null,90]
["Added email button and hyperlinks"]
[null,null,null,null,null,null,null,null,null,"Year commence (for journals)",null,null,{"$f":"EOMONTH(IF(MONTH(DateCommence) < 6, DATE(YEAR(DateCommence), 6, 1), DATE(YEAR(DateCommence) + 1, 6, 1)), 0)","v":"1900-06-30"}]
[]
[null,null,null,null,null,null,null,null,null,"Payment No","Borrowing Expenses","Cumulative Borr Xps"]
[null,null,null,null,null,null,null,null,null,{"$f":"IF('Hire Purchase'!F18>0,1,0)","v":0},{"$f":"IF(AND(J18=1,'Hire Purchase'!$I$9<=$M$3),'Hire Purchase'!$I$9,IF(AND(J18>0,'Hire Purchase'!$I$9>$M$3,J18<=MIN('Hire Purchase'!$I$7,$M$4)),'Hire Purchase'!$I$9/MIN('Hire Purchase'!$I$7,$M$4),0))","v":0},{"$f":"K18","v":0}]
[null,null,null,null,null,null,null,null,null,{"$f":"IF(J18>0,J18+1,IF('Hire Purchase'!F19>0,1,0))","v":0},{"$f":"IF(AND(J19=1,'Hire Purchase'!$I$9<=$M$3),'Hire Purchase'!$I$9,IF(AND(J19>0,'Hire Purchase'!$I$9>$M$3,J19<=MIN('Hire Purchase'!$I$7,$M$4)),'Hire Purchase'!$I$9/MIN('Hire Purchase'!$I$7,$M$4),0))","v":0},{"$f":"L18+K19","v":0}]
[null,null,null,null,null,null,null,null,null,{"$f":"IF(J19>0,J19+1,IF('Hire Purchase'!F20>0,1,0))","v":0},{"$f":"IF(AND(J20=1,'Hire Purchase'!$I$9<=$M$3),'Hire Purchase'!$I$9,IF(AND(J20>0,'Hire Purchase'!$I$9>$M$3,J20<=MIN('Hire Purchase'!$I$7,$M$4)),'Hire Purchase'!$I$9/MIN('Hire Purchase'!$I$7,$M$4),0))","v":0},0]
[null,null,null,null,null,null,null,null,null,{"$f":"IF('Hire Purchase'!$I$10>0,J20+1,0)","v":0},{"$f":"IF(AND(J21=1,'Hire Purchase'!$I$9<=$M$3),'Hire Purchase'!$I$9,IF(AND(J21>0,'Hire Purchase'!$I$9>$M$3,J21<=MIN('Hire Purchase'!$I$7,$M$4)),'Hire Purchase'!$I$9/MIN('Hire Purchase'!$I$7,$M$4),0))","v":0},0]
[null,null,null,null,null,null,null,null,null,{"$f":"IF('Hire Purchase'!$I$10>0,J21+1,0)","v":0},{"$f":"IF(AND(J22=1,'Hire Purchase'!$I$9<=$M$3),'Hire Purchase'!$I$9,IF(AND(J22>0,'Hire Purchase'!$I$9>$M$3,J22<=MIN('Hire Purchase'!$I$7,$M$4)),'Hire Purchase'!$I$9/MIN('Hire Purchase'!$I$7,$M$4),0))","v":0},0]
[null,null,null,null,null,null,null,null,null,{"$f":"IF('Hire Purchase'!$I$10>0,J22+1,0)","v":0},{"$f":"IF(AND(J23=1,'Hire Purchase'!$I$9<=$M$3),'Hire Purchase'!$I$9,IF(AND(J23>0,'Hire Purchase'!$I$9>$M$3,J23<=MIN('Hire Purchase'!$I$7,$M$4)),'Hire Purchase'!$I$9/MIN('Hire Purchase'!$I$7,$M$4),0))","v":0},0]
[null,null,null,null,null,null,null,null,null,{"$f":"IF('Hire Purchase'!$I$10>0,J23+1,0)","v":0},{"$f":"IF(AND(J24=1,'Hire Purchase'!$I$9<=$M$3),'Hire Purchase'!$I$9,IF(AND(J24>0,'Hire Purchase'!$I$9>$M$3,J24<=MIN('Hire Purchase'!$I$7,$M$4)),'Hire Purchase'!$I$9/MIN('Hire Purchase'!$I$7,$M$4),0))","v":0},0]
[null,null,null,null,null,null,null,null,null,{"$f":"IF('Hire Purchase'!$I$10>0,J24+1,0)","v":0},{"$f":"IF(AND(J25=1,'Hire Purchase'!$I$9<=$M$3),'Hire Purchase'!$I$9,IF(AND(J25>0,'Hire Purchase'!$I$9>$M$3,J25<=MIN('Hire Purchase'!$I$7,$M$4)),'Hire Purchase'!$I$9/MIN('Hire Purchase'!$I$7,$M$4),0))","v":0},0]
[null,null,null,null,null,null,null,null,null,{"$f":"IF('Hire Purchase'!$I$10>0,J25+1,0)","v":0},{"$f":"IF(AND(J26=1,'Hire Purchase'!$I$9<=$M$3),'Hire Purchase'!$I$9,IF(AND(J26>0,'Hire Purchase'!$I$9>$M$3,J26<=MIN('Hire Purchase'!$I$7,$M$4)),'Hire Purchase'!$I$9/MIN('Hire Purchase'!$I$7,$M$4),0))","v":0},0]
[null,null,null,null,null,null,null,null,null,{"$f":"IF('Hire Purchase'!$I$10>0,J26+1,0)","v":0},{"$f":"IF(AND(J27=1,'Hire Purchase'!$I$9<=$M$3),'Hire Purchase'!$I$9,IF(AND(J27>0,'Hire Purchase'!$I$9>$M$3,J27<=MIN('Hire Purchase'!$I$7,$M$4)),'Hire Purchase'!$I$9/MIN('Hire Purchase'!$I$7,$M$4),0))","v":0},0]
[null,null,null,null,null,null,null,null,null,{"$f":"IF('Hire Purchase'!$I$10>0,J27+1,0)","v":0},{"$f":"IF(AND(J28=1,'Hire Purchase'!$I$9<=$M$3),'Hire Purchase'!$I$9,IF(AND(J28>0,'Hire Purchase'!$I$9>$M$3,J28<=MIN('Hire Purchase'!$I$7,$M$4)),'Hire Purchase'!$I$9/MIN('Hire Purchase'!$I$7,$M$4),0))","v":0},0]
[null,null,null,null,null,null,null,null,null,{"$f":"IF('Hire Purchase'!$I$10>0,J28+1,0)","v":0},{"$f":"IF(AND(J29=1,'Hire Purchase'!$I$9<=$M$3),'Hire Purchase'!$I$9,IF(AND(J29>0,'Hire Purchase'!$I$9>$M$3,J29<=MIN('Hire Purchase'!$I$7,$M$4)),'Hire Purchase'!$I$9/MIN('Hire Purchase'!$I$7,$M$4),0))","v":0},0]
[null,null,null,null,null,null,null,null,null,{"$f":"IF('Hire Purchase'!$I$10>0,J29+1,0)","v":0},{"$f":"IF(AND(J30=1,'Hire Purchase'!$I$9<=$M$3),'Hire Purchase'!$I$9,IF(AND(J30>0,'Hire Purchase'!$I$9>$M$3,J30<=MIN('Hire Purchase'!$I$7,$M$4)),'Hire Purchase'!$I$9/MIN('Hire Purchase'!$I$7,$M$4),0))","v":0},0]
{"$rows_left_out":79}
{"sheet":"Hire Purchase","index":1,"n_rows":109,"n_cols":15,"rows_kept":109,"cut":false,"hidden":false,"merged":[[0,10,0,12],[1,10,1,12],[4,2,4,4],[3,2,3,4],[11,6,13,8],[7,6,7,7],[9,2,9,4],[8,6,8,7],[9,6,9,7],[7,2,7,4],[10,2,10,4],[4,6,4,7],[3,6,3,8],[15,7,15,9],[15,2,15,6],[5,6,5,7],[6,2,6,4],[12,2,12,3],[6,6,6,7],[3,14,3,16],[14,14,14,16],[15,10,15,11],[4,14,7,16],[3,10,3,12],[9,14,9,16],[10,14,12,16],[15,14,16,16]]}
[null,"ℹ","Hire Purchase Schedule",null,null,null,null,null,null,null,"Client Name"]
[null,null,"Regular Monthly Repayments",null,null,null,null,null,null,null,"Preparer Name"]
[]
[null,null,"Lender",null,null,null,"Loan Details",null,null,null,"Annual Summary",null,null,null,"Journal Worksheet"]
[null,null,null,null,null,null,"Amount Borrowed",null,null,null,"Year","Interest","Borrowing",null,"Use the Journal Worksheet to quickly calculate the journals required to update your general ledger with the acquisition and EOFY balances each year."]
[null,null,null,null,null,null,"Monthly Repayments",null,null,null,{"$f":"IF(I10>0,IF(MONTH(I10)<=6,YEAR(I10),YEAR(I10)+1),0)","v":0},{"$f":"IF($I$10>0,SUMIF(Control!$J$18:$J$107,\"<=\" & IF($C$11=\"On Commencement\",Control!L6,Control!L6-1),$E$18:$E$107),0)","v":0},{"$f":"IF(Control!J108>0,VLOOKUP(Control!L6,Control!J18:L107,3,FALSE),0)","v":0}]
[null,null,"Asset Acquired",null,null,null,"Term (months)",null,null,null,{"$f":"IF(L7>1,K6+1,0)","v":0},{"$f":"IF($I$10>0,SUMIF(Control!$J$18:$J$107,\"<=\" & IF($C$11=\"On Commencement\",Control!L7,Control!L7-1),$E$18:$E$107)-L6,0)","v":0},{"$f":"IF(Control!J108>0,VLOOKUP(Control!L7,Control!J19:L108,3,FALSE)-M6,0)","v":0}]
[null,null,null,null,null,null,"Residual",null,null,null,0,{"$f":"IF($I$10>0,SUMIF(Control!$J$18:$J$107,\"<=\" & IF($C$11=\"On Commencement\",Control!L8,Control!L8-1),$E$18:$E$107)-SUM(L6:L7),0)","v":0},{"$f":"IF(Control!J108>0,VLOOKUP(Control!L8,Control!J20:L109,3,FALSE)-SUM(M6:M7),0)","v":0}]
[null,null,null,null,null,null,"Borrowing Costs",null,null,null,0,{"$f":"IF($I$10>0,SUMIF(Control!$J$18:$J$107,\"<=\" & IF($C$11=\"On Commencement\",Control!L9,Control!L9-1),$E$18:$E$107)-SUM(L6:L8),0)","v":0},{"$f":"IF(Control!J108>0,VLOOKUP(Control!L9,Control!J21:L110,3,FALSE)-SUM(M6:M8),0)","v":0}]
[null,null,"First Payment",null,null,null,"Date Commenced",null,null,null,0,{"$f":"IF($I$10>0,SUMIF(Control!$J$18:$J$107,\"<=\" & IF($C$11=\"On Commencement\",Control!L10,Control!L10-1),$E$18:$E$107)-SUM(L6:L9),0)","v":0},{"$f":"IF(Control!J108>0,VLOOKUP(Control!L10,Control!J22:L111,3,FALSE)-SUM(M6:M9),0)","v":0},null,"Help or Feedback"]
[null,null,"Please Select",null,null,null,null,null,null,null,0,{"$f":"IF($I$10>0,SUMIF(Control!$J$18:$J$107,\"<=\" & IF($C$11=\"On Commencement\",Control!L11,Control!L11-1),$E$18:$E$107)-SUM(L6:L10),0)","v":0},{"$f":"IF(Control!J108>0,VLOOKUP(Control!L11,Control!J23:L112,3,FALSE)-SUM(M6:M10),0)","v":0},null,"Click on the mail button above to send us an email to get help on using this spreadsheet or to provide feedback."]
[null,null,null,null,null,null,{"$f":"IF(AND(I5>0,I6>0,I7>0),IF((I6*I7)+I8<=I5,\"There is no interest to calculate because monthly repayments plus any residual do not exceed the original amount borrowed\",\"\"),\"\")","v":""},null,null,null,0,{"$f":"IF($I$10>0,SUMIF(Control!$J$18:$J$107,\"<=\" & IF($C$11=\"On Commencement\",Control!L12,Control!L12-1),$E$18:$E$107)-SUM(L6:L11),0)","v":0}]
[null,null,"Interest Rate/Month",null,{"$f":"IF(AND(I5>0,(I6*I7)+I8>I5),RATE(I7,I6,-I5,I8,IF(C11=\"On Commencement\",1,0)),0)","v":0},null,null,null,null,null,0,{"$f":"IF($I$10>0,SUMIF(Control!$J$18:$J$107,\"<=\" & IF($C$11=\"On Commencement\",Control!L13,Control!L13-1),$E$18:$E$107)-SUM(L6:L12),0)","v":0}]
[null,null,"Effective Annual Rate",null,{"$f":"IF(E13>0,EFFECT(E13*12,12),0)","v":0},null,null,null,null,null,"Totals",{"$f":"SUM(L6:L13)","v":0},{"$f":"SUM(M6:M13)","v":0}]
[null,null,null,null,null,null,null,null,null,null,null,null,null,null,"Warning - Drag & Drop"]
[null,null,"Amortisation",null,null,null,null,"Liability",null,null,"Unexpired Interest",null,"Borrowing",null,"Dragging and dropping one or more cells to any cell that is referenced in a formula will produce a formula error."]
[null,null,"Month","Opening\nBalance","Add\nInterest","Less\nRepayments","Closing\nBalance","Account\nBalance","Current\nLiability","Non-Current\nLiability","Current\nUnexpired Int","Non-Current\nUnexpired Int","Borrowing\nCosts"]
[null,null,{"$f":"IF($I$10>0,IF(MONTH($I$10)=1,EOMONTH($I$10,0),0)+IF(MONTH($I$10)=4,EOMONTH($I$10,0),0)+IF(MONTH($I$10)=7,EOMONTH($I$10,0),0)+IF(MONTH($I$10)=10,EOMONTH($I$10,0),0),0)","v":"00:00:00"},{"$f":"IF(C18>0,I5,0)","v":0},null,{"$f":"IF(AND(C18>0,$C$11=\"On Commencement\"),$I$6,0)","v":0},{"$f":"IF(C18>0,ROUND(D18+E18-F18,8),0)","v":0},{"$f":"IF(C18>0,($I$6*$I$7)+$I$8-F18,0)","v":0},{"$f":"IF(H18>0,SUM(F19:F30),0)","v":0},{"$f":"IF(H18>I18,H18-I18,0)","v":0},{"$f":"IF(H18>0,SUM(E19:E30),0)","v":0},{"$f":"IF(H18>0,SUM(E31:$E$107),0)","v":0},{"$f":"Control!K18","v":0}]
[null,null,{"$f":"IF(AND(I10>0,C18>0),EOMONTH(C18,1),IF(MONTH($I$10)=2,EOMONTH($I$10,0),0)+IF(MONTH($I$10)=5,EOMONTH($I$10,0),0)+IF(MONTH($I$10)=8,EOMONTH($I$10,0),0)+IF(MONTH($I$10)=11,EOMONTH($I$10,0),0))","v":"00:00:00"},{"$f":"IF(G18>0,G18,IF(C19>0,I5,0))","v":0},{"$f":"IF(AND(D19>0,D18>0),D19*$E$13,0)","v":0},{"$f":"IF(AND(C18>0,C19>0),$I$6,IF(AND(C19>0,C11=\"On Commencement\"),$I$6,0))","v":0},0,{"$f":"IF(H18>0,H18-F19,IF(C19>0,(I6*I7)+I8-F19,0))","v":0},0,0,{"$f":"IF(H19>0,SUM(E20:E31),0)","v":0},{"$f":"IF(H19>0,SUM(E32:$E$107),0)","v":0},{"$f":"Control!K19","v":0}]
[null,null,{"$f":"IF(AND(I10>0,C19>0),EOMONTH(C19,1),IF(MONTH($I$10)=3,EOMONTH($I$10,0),0)+IF(MONTH($I$10)=6,EOMONTH($I$10,0),0)+IF(MONTH($I$10)=9,EOMONTH($I$10,0),0)+IF(MONTH($I$10)=12,EOMONTH($I$10,0),0))","v":"00:00:00"},{"$f":"IF(G19>0,G19,IF(C20>0,$I$5,0))","v":0},{"$f":"IF(AND(D20>0,D19>0),D20*$E$13,0)","v":0},{"$f":"IF(C19>0,$I$6,IF(AND(C20>0,$C$11=\"On Commencement\"),$I$6,0))","v":0},0,{"$f":"IF(I10>0,IF(H19>0,H19-F20,(I6*I7)+I8-F20),0)","v":0},0,0,{"$f":"SUM(E21:E32)","v":0},{"$f":"IF(H20>0,SUM(E33:$E$107),0)","v":0},{"$f":"Control!K20","v":0}]
[{"$f":"IF(C21<>0,0,\"blank\")","v":"blank"},null,{"$f":"IF($I$10>0,IF(Control!J21<=$I$7+IF($I$8>0,1,0),EOMONTH(C20,1),0),0)","v":"00:00:00"},{"$f":"IF(AND(G20>0,C21>0),G20,0)","v":0},{"$f":"IF(AND(D21>0,Control!J21<=$I$7+IF(AND($I$8>0,$C$11=\"On Commencement\"),1,0)),D21*$E$13,0)","v":0},{"$f":"IF($I$10>0,IF(Control!J21<=$I$7,$I$6,0)+IF(Control!J21=$I$7+1,$I$8,0),0)","v":0},0,{"$f":"ROUND(H20-F21,2)","v":0},0,0,0,{"$f":"IF(H21>0,SUM(E34:$E$107),0)","v":0},{"$f":"Control!K21","v":0}]
["blank",null,{"$f":"IF($I$10>0,IF(Control!J22<=$I$7+IF($I$8>0,1,0),EOMONTH(C21,1),0),0)","v":"00:00:00"},0,{"$f":"IF(AND(D22>0,Control!J22<=$I$7+IF(AND($I$8>0,$C$11=\"On Commencement\"),1,0)),D22*$E$13,0)","v":0},{"$f":"IF($I$10>0,IF(Control!J22<=$I$7,$I$6,0)+IF(Control!J22=$I$7+1,$I$8,0),0)","v":0},0,0,0,0,0,{"$f":"IF(H22>0,SUM(E35:$E$107),0)","v":0},{"$f":"Control!K22","v":0}]
["blank",null,{"$f":"IF($I$10>0,IF(Control!J23<=$I$7+IF($I$8>0,1,0),EOMONTH(C22,1),0),0)","v":"00:00:00"},0,{"$f":"IF(AND(D23>0,Control!J23<=$I$7+IF(AND($I$8>0,$C$11=\"On Commencement\"),1,0)),D23*$E$13,0)","v":0},{"$f":"IF($I$10>0,IF(Control!J23<=$I$7,$I$6,0)+IF(Control!J23=$I$7+1,$I$8,0),0)","v":0},0,0,0,0,0,{"$f":"IF(H23>0,SUM(E36:$E$107),0)","v":0},{"$f":"Control!K23","v":0}]
["blank",null,{"$f":"IF($I$10>0,IF(Control!J24<=$I$7+IF($I$8>0,1,0),EOMONTH(C23,1),0),0)","v":"00:00:00"},0,{"$f":"IF(AND(D24>0,Control!J24<=$I$7+IF(AND($I$8>0,$C$11=\"On Commencement\"),1,0)),D24*$E$13,0)","v":0},{"$f":"IF($I$10>0,IF(Control!J24<=$I$7,$I$6,0)+IF(Control!J24=$I$7+1,$I$8,0),0)","v":0},0,0,0,0,0,{"$f":"IF(H24>0,SUM(E37:$E$107),0)","v":0},{"$f":"Control!K24","v":0}]
["blank",null,{"$f":"IF($I$10>0,IF(Control!J25<=$I$7+IF($I$8>0,1,0),EOMONTH(C24,1),0),0)","v":"00:00:00"},0,{"$f":"IF(AND(D25>0,Control!J25<=$I$7+IF(AND($I$8>0,$C$11=\"On Commencement\"),1,0)),D25*$E$13,0)","v":0},{"$f":"IF($I$10>0,IF(Control!J25<=$I$7,$I$6,0)+IF(Control!J25=$I$7+1,$I$8,0),0)","v":0},0,0,0,0,0,{"$f":"IF(H25>0,SUM(E38:$E$107),0)","v":0},{"$f":"Control!K25","v":0}]
["blank",null,{"$f":"IF($I$10>0,IF(Control!J26<=$I$7+IF($I$8>0,1,0),EOMONTH(C25,1),0),0)","v":"00:00:00"},0,{"$f":"IF(AND(D26>0,Control!J26<=$I$7+IF(AND($I$8>0,$C$11=\"On Commencement\"),1,0)),D26*$E$13,0)","v":0},{"$f":"IF($I$10>0,IF(Control!J26<=$I$7,$I$6,0)+IF(Control!J26=$I$7+1,$I$8,0),0)","v":0},0,0,0,0,0,{"$f":"IF(H26>0,SUM(E39:$E$107),0)","v":0},{"$f":"Control!K26","v":0}]
["blank",null,{"$f":"IF($I$10>0,IF(Control!J27<=$I$7+IF($I$8>0,1,0),EOMONTH(C26,1),0),0)","v":"00:00:00"},0,{"$f":"IF(AND(D27>0,Control!J27<=$I$7+IF(AND($I$8>0,$C$11=\"On Commencement\"),1,0)),D27*$E$13,0)","v":0},{"$f":"IF($I$10>0,IF(Control!J27<=$I$7,$I$6,0)+IF(Control!J27=$I$7+1,$I$8,0),0)","v":0},0,0,0,0,0,{"$f":"IF(H27>0,SUM(E40:$E$107),0)","v":0},{"$f":"Control!K27","v":0}]
["blank",null,{"$f":"IF($I$10>0,IF(Control!J28<=$I$7+IF($I$8>0,1,0),EOMONTH(C27,1),0),0)","v":"00:00:00"},0,{"$f":"IF(AND(D28>0,Control!J28<=$I$7+IF(AND($I$8>0,$C$11=\"On Commencement\"),1,0)),D28*$E$13,0)","v":0},{"$f":"IF($I$10>0,IF(Control!J28<=$I$7,$I$6,0)+IF(Control!J28=$I$7+1,$I$8,0),0)","v":0},0,0,0,0,0,{"$f":"IF(H28>0,SUM(E41:$E$107),0)","v":0},{"$f":"Control!K28","v":0}]
["blank",null,{"$f":"IF($I$10>0,IF(Control!J29<=$I$7+IF($I$8>0,1,0),EOMONTH(C28,1),0),0)","v":"00:00:00"},0,{"$f":"IF(AND(D29>0,Control!J29<=$I$7+IF(AND($I$8>0,$C$11=\"On Commencement\"),1,0)),D29*$E$13,0)","v":0},{"$f":"IF($I$10>0,IF(Control!J29<=$I$7,$I$6,0)+IF(Control!J29=$I$7+1,$I$8,0),0)","v":0},0,0,0,0,0,{"$f":"IF(H29>0,SUM(E42:$E$107),0)","v":0},{"$f":"Control!K29","v":0}]
["blank",null,{"$f":"IF($I$10>0,IF(Control!J30<=$I$7+IF($I$8>0,1,0),EOMONTH(C29,1),0),0)","v":"00:00:00"},0,{"$f":"IF(AND(D30>0,Control!J30<=$I$7+IF(AND($I$8>0,$C$11=\"On Commencement\"),1,0)),D30*$E$13,0)","v":0},{"$f":"IF($I$10>0,IF(Control!J30<=$I$7,$I$6,0)+IF(Control!J30=$I$7+1,$I$8,0),0)","v":0},0,0,0,0,0,{"$f":"IF(H30>0,SUM(E43:$E$107),0)","v":0},{"$f":"Control!K30","v":0}]
{"$rows_left_out":80}
{"sheet":"Journal Worksheet","index":2,"n_rows":47,"n_cols":15,"rows_kept":47,"cut":false,"hidden":false,"merged":[[40,1,40,3],[5,1,5,2],[27,1,27,3],[6,1,6,2],[13,11,13,13],[27,11,27,13],[40,11,40,13],[40,6,40,8],[13,6,13,8],[27,6,27,8],[11,1,11,2],[12,1,12,2]]}
[]
[null,"Hire Purchase Journal Worksheet",null,null,null,null,null,null,null,null,null,null,null,null,{"$f":"'Hire Purchase'!K1","v":"Client Name"}]
[null,{"$f":"'Hire Purchase'!C2","v":"Regular Monthly Repayments"},null,null,null,null,null,null,null,null,null,null,null,null,{"$f":"CONCATENATE(\"Prepared by \",'Hire Purchase'!K2)","v":"Prepared by Preparer Name"}]
[]
[null,{"$f":"CONCATENATE(\"Acquisition Dated \",IF('Hire Purchase'!I10>0,TEXT('Hire Purchase'!I10,\"dd/mm/yyyy\"),\"\"))","v":"Acquisition Dated "},null,"Dr","Cr",null,{"$f":"IF('Hire Purchase'!I10<>\"\",CONCATENATE(\"Year Ended 30 June \",IF(MONTH('Hire Purchase'!I10)<=6,YEAR('Hire Purchase'!I10),YEAR('Hire Purchase'!I10)+1)),\"\")","v":""},"Schedule","Ledger","Journal",null,{"$f":"IF('Hire Purchase'!I10<>\"\",CONCATENATE(\"Year Ended 30 June \",IF(MONTH('Hire Purchase'!I10)<=6,YEAR('Hire Purchase'!I10)+1,YEAR('Hire Purchase'!I10)+2)),\"\")","v":""},"Schedule","Ledger","Journal"]
[null,{"$f":"CONCATENATE(\"Cost - \",'Hire Purchase'!C8)","v":"Cost - "},null,null,null,null,"Hire purchase charges amortised",{"$f":"'Hire Purchase'!L6","v":0},null,{"$f":"H6-I6","v":0},null,"Hire purchase charges amortised",{"$f":"'Hire Purchase'!L7","v":0},null,{"$f":"M6-N6","v":0}]
[null,"Deposit amount and source   (if applicable)",null,null,null,null,"Current liability",{"$f":"IFERROR(-VLOOKUP(EOMONTH(YearEnd,0),HpSchedule,7,FALSE),0)","v":0},null,{"$f":"H7-I7","v":0},null,"Current liability",{"$f":"IFERROR(-VLOOKUP(EOMONTH(YearEnd,12),HpSchedule,7,FALSE),0)","v":0},null,{"$f":"M7-N7","v":0}]
[null,"Liability","Current",null,{"$f":"IF('Hire Purchase'!I10>0,INDEX('Hire Purchase'!I18:I1048576, MATCH(TRUE, INDEX('Hire Purchase'!I18:I1048576<>0, 0), 0)),0)","v":0},null,"Unexpired current interest",{"$f":"IFERROR(VLOOKUP(EOMONTH(YearEnd,0),HpSchedule,9,FALSE),0)","v":0},null,{"$f":"H8-I8","v":0},null,"Unexpired current interest",{"$f":"IFERROR(VLOOKUP(EOMONTH(YearEnd,12),HpSchedule,9,FALSE),0)","v":0},null,{"$f":"M8-N8","v":0}]
[null,null,"Non-current",null,{"$f":"IF('Hire Purchase'!I10>0,INDEX('Hire Purchase'!J18:J1048576, MATCH(TRUE, INDEX('Hire Purchase'!J18:J1048576<>0, 0), 0)),0)+IF('Hire Purchase'!C11=\"On Commencement\",'Hire Purchase'!I6,0)","v":0},null,"Non-current liability",{"$f":"IFERROR(-VLOOKUP(EOMONTH(YearEnd,0),HpSchedule,8,FALSE),0)","v":0},null,0,null,"Non-current liability",{"$f":"IFERROR(-VLOOKUP(EOMONTH(YearEnd,12),HpSchedule,8,FALSE),0)","v":0},null,0]
[null,"Unexpired interest","Current",{"$f":"IF('Hire Purchase'!I10>0,INDEX('Hire Purchase'!K18:K1048576, MATCH(TRUE, INDEX('Hire Purchase'!K18:K1048576<>0, 0), 0)),0)","v":0},null,null,"Unexpired non-current interest",{"$f":"IFERROR(VLOOKUP(EOMONTH(YearEnd,0),HpSchedule,10,FALSE),0)","v":0},null,0,null,"Unexpired non-current interest",{"$f":"IFERROR(VLOOKUP(EOMONTH(YearEnd,12),HpSchedule,10,FALSE),0)","v":0},null,0]
[null,null,"Non-current",{"$f":"IF('Hire Purchase'!I10>0,INDEX('Hire Purchase'!L18:L1048576, MATCH(TRUE, INDEX('Hire Purchase'!L18:L1048576<>0, 0), 0)),0)","v":0},null,null,"Borrowing costs amortised",{"$f":"'Hire Purchase'!M6","v":0},null,0,null,"Borrowing costs amortised",{"$f":"'Hire Purchase'!M7","v":0},null,0]
[null,"Borrowing costs",null,null,{"$f":"'Hire Purchase'!M14","v":0},null,"Borrowing costs ",{"$f":"'Hire Purchase'!$I$9","v":0},null,0,null,"Borrowing costs ",{"$f":"'Hire Purchase'!$I$9","v":0},null,0]
[null,"Unexpired borrowing costs",null,{"$f":"E12","v":0},null,null,"Borrowing costs written off",{"$f":"-H11","v":0},null,0,null,"Borrowing costs written off",{"$f":"H13-M11","v":0},null,0]
[null,null,null,{"$f":"ROUND(SUM(D6:D13),2)","v":0},{"$f":"ROUND(SUM(E6:E13),2)","v":0},null,"Describe where to post any unreconciled balance",null,null,{"$f":"SUM(J6:J13)","v":0},null,"Describe where to post any unreconciled balance",null,null,{"$f":"SUM(O6:O13)","v":0}]
[null,null,null,{"$f":"IF(D14<>E14,\"Out of balance\",\"\")","v":""},{"$f":"IF(D14<>E14,D14-E14,\"\")","v":""}]
[]
[]
[]
[null,{"$f":"IF('Hire Purchase'!I10<>\"\",CONCATENATE(\"Year Ended 30 June \",IF(MONTH('Hire Purchase'!I10)<=6,YEAR('Hire Purchase'!I10)+2,YEAR('Hire Purchase'!I10)+3)),\"\")","v":""},"Schedule","Ledger","Journal",null,{"$f":"IF('Hire Purchase'!I10<>\"\",CONCATENATE(\"Year Ended 30 June \",IF(MONTH('Hire Purchase'!I10)<=6,YEAR('Hire Purchase'!I10)+3,YEAR('Hire Purchase'!I10)+4)),\"\")","v":""},"Schedule","Ledger","Journal",null,{"$f":"IF('Hire Purchase'!I10<>\"\",CONCATENATE(\"Year Ended 30 June \",IF(MONTH('Hire Purchase'!I10)<=6,YEAR('Hire Purchase'!I10)+4,YEAR('Hire Purchase'!I10)+5)),\"\")","v":""},"Schedule","Ledger","Journal"]
[null,"Hire purchase charges amortised",{"$f":"'Hire Purchase'!L8","v":0},null,{"$f":"C20-D20","v":0},null,"Hire purchase charges amortised",{"$f":"'Hire Purchase'!L9","v":0},null,{"$f":"H20-I20","v":0},null,"Hire purchase charges amortised",{"$f":"'Hire Purchase'!L10","v":0},null,{"$f":"M20-N20","v":0}]
[null,"Current liability",{"$f":"IFERROR(-VLOOKUP(EOMONTH(YearEnd,24),HpSchedule,7,FALSE),0)","v":0},null,{"$f":"C21-D21","v":0},null,"Current liability",{"$f":"IFERROR(-VLOOKUP(EOMONTH(YearEnd,36),HpSchedule,7,FALSE),0)","v":0},null,{"$f":"H21-I21","v":0},null,"Current liability",{"$f":"IFERROR(-VLOOKUP(EOMONTH(YearEnd,48),HpSchedule,7,FALSE),0)","v":0},null,{"$f":"M21-N21","v":0}]
[null,"Unexpired current interest",{"$f":"IFERROR(VLOOKUP(EOMONTH(YearEnd,24),HpSchedule,9,FALSE),0)","v":0},null,{"$f":"C22-D22","v":0},null,"Unexpired current interest",{"$f":"IFERROR(VLOOKUP(EOMONTH(YearEnd,36),HpSchedule,9,FALSE),0)","v":0},null,{"$f":"H22-I22","v":0},null,"Unexpired current interest",{"$f":"IFERROR(VLOOKUP(EOMONTH(YearEnd,48),HpSchedule,9,FALSE),0)","v":0},null,{"$f":"M22-N22","v":0}]
[null,"Non-current liability",{"$f":"IFERROR(-VLOOKUP(EOMONTH(YearEnd,24),HpSchedule,8,FALSE),0)","v":0},null,0,null,"Non-current liability",{"$f":"IFERROR(-VLOOKUP(EOMONTH(YearEnd,36),HpSchedule,8,FALSE),0)","v":0},null,0,null,"Non-current liability",{"$f":"IFERROR(-VLOOKUP(EOMONTH(YearEnd,48),HpSchedule,8,FALSE),0)","v":0},null,0]
[null,"Unexpired non-current interest",{"$f":"IFERROR(VLOOKUP(EOMONTH(YearEnd,24),HpSchedule,10,FALSE),0)","v":0},null,0,null,"Unexpired non-current interest",{"$f":"IFERROR(VLOOKUP(EOMONTH(YearEnd,36),HpSchedule,10,FALSE),0)","v":0},null,0,null,"Unexpired non-current interest",{"$f":"IFERROR(VLOOKUP(EOMONTH(YearEnd,48),HpSchedule,10,FALSE),0)","v":0},null,0]
[null,"Borrowing costs amortised",{"$f":"'Hire Purchase'!M8","v":0},null,0,null,"Borrowing costs amortised",{"$f":"'Hire Purchase'!M9","v":0},null,0,null,"Borrowing costs amortised",{"$f":"'Hire Purchase'!M10","v":0},null,0]
[null,"Borrowing costs ",{"$f":"'Hire Purchase'!$I$9","v":0},null,0,null,"Borrowing costs ",{"$f":"'Hire Purchase'!$I$9","v":0},null,0,null,"Borrowing costs ",{"$f":"'Hire Purchase'!$I$9","v":0},null,0]
[null,"Borrowing costs written off",{"$f":"M13-C25","v":0},null,0,null,"Borrowing costs written off",{"$f":"C27-H25","v":0},null,0,null,"Borrowing costs written off",{"$f":"H27-M25","v":0},null,0]
[null,"Describe where to post any unreconciled balance",null,null,{"$f":"SUM(E20:E27)","v":0},null,"Describe where to post any unreconciled balance",null,null,{"$f":"SUM(J20:J27)","v":0},null,"Describe where to post any unreconciled balance",null,null,{"$f":"SUM(O20:O27)","v":0}]
[]
[]
{"$rows_left_out":18}
{"sheet":"Sheet1","index":3,"n_rows":0,"n_cols":0,"rows_kept":0,"cut":false,"hidden":false,"merged":[]}